Reaction Details
TargetCarbonic anhydrase 1
LigandBDBM12921
Substrate/Competitorn/a
Meas. Tech.ChEMBL_625070 (CHEMBL1112519)
Ki 4400±n/a nM
Citation Lopez, MBornaghi, LFInnocenti, AVullo, DCharman, SASupuran, CTPoulsen, SA Sulfonamide linked neoglycoconjugates--a new class of inhibitors for cancer-associated carbonic anhydrases. J Med Chem53:2913-26 (2010) 
 
Carbonic anhydrase 1
Name:Carbonic anhydrase 1
Type:Enzyme
Mol. Mass.:28873.37
Organism:Homo sapiens (Human)
Description:P00915
Residue:261
BDBM12921
NameBDBM12921
Synonyms:4-({[4-(Aminosulfonyl)benzoyl]oxy}methyl-1-(beta-D-glucopyranosyl)-1H-1,2,3-triazole Glycoconjugate Benzene Sulfonamide 3aa | {1-[(2R,3R,4S,5S,6R)-3,4,5-trihydroxy-6-(hydroxymethyl)oxan-2-yl]-1H-1,2,3-triazol-4-yl}methyl 4-sulfamoylbenzoate
TypeSmall organic molecule
Emp. Form.C16H20N4O9S
Mol. Mass.444.416
SMILESNS(=O)(=O)c1ccc(cc1)C(=O)OCc1cn(nn1)[C@@H]1O[C@H](CO)[C@@H](O)[C@H](O)[C@H]1O