Reaction Details
TargetCarbonic anhydrase 12
LigandBDBM50314529
Substrate/Competitorn/a
Meas. Tech.ChEMBL_625073 (CHEMBL1112522)
Ki 7.6±n/a nM
Citation Lopez, MBornaghi, LFInnocenti, AVullo, DCharman, SASupuran, CTPoulsen, SA Sulfonamide linked neoglycoconjugates--a new class of inhibitors for cancer-associated carbonic anhydrases. J Med Chem53:2913-26 (2010) 
 
Carbonic anhydrase 12
Name:Carbonic anhydrase 12
Type:Enzyme
Mol. Mass.:39456.00
Organism:Homo sapiens (Human)
Description:Catalytic domain of human cloned isozyme was used in the assay
Residue:354
BDBM50314529
NameBDBM50314529
Synonyms:CHEMBL1089371 | N-(4-Aminosulfonyl)phenethyl-S-(1-thio-beta-D-glucopyranosylsulfonamide
TypeSmall organic molecule
Emp. Form.C14H22N2O9S2
Mol. Mass.426.462
SMILESNS(=O)(=O)c1ccc(CCNS(=O)(=O)[C@@H]2O[C@H](CO)[C@@H](O)[C@H](O)[C@H]2O)cc1