Reaction Details
TargetCarbonic anhydrase 12
LigandBDBM50278846
Substrate/Competitorn/a
Meas. Tech.ChEMBL_625073 (CHEMBL1112522)
Ki 10.3±n/a nM
Citation Lopez, MBornaghi, LFInnocenti, AVullo, DCharman, SASupuran, CTPoulsen, SA Sulfonamide linked neoglycoconjugates--a new class of inhibitors for cancer-associated carbonic anhydrases. J Med Chem53:2913-26 (2010) 
 
Carbonic anhydrase 12
Name:Carbonic anhydrase 12
Type:Enzyme
Mol. Mass.:39456.00
Organism:Homo sapiens (Human)
Description:Catalytic domain of human cloned isozyme was used in the assay
Residue:354
BDBM50278846
NameBDBM50278846
Synonyms:4-(4-(((2S,3R,4S,5S,6R)-3,4,5-trihydroxy-6-(hydroxymethyl)tetrahydro-2H-pyran-2-ylsulfonyl)methyl)-1H-1,2,3-triazol-1-yl)benzenesulfonamide CHEMBL498757
TypeSmall organic molecule
Emp. Form.C15H20N4O9S2
Mol. Mass.464.471
SMILESNS(=O)(=O)c1ccc(cc1)-n1cc(CS(=O)(=O)[C@@H]2O[C@H](CO)[C@@H](O)[C@H](O)[C@H]2O)nn1