Reaction Details
TargetCarbonic anhydrase 2
LigandBDBM50314536
Substrate/Competitorn/a
Meas. Tech.ChEMBL_625071 (CHEMBL1112520)
Ki 13.4±n/a nM
Citation Lopez, MBornaghi, LFInnocenti, AVullo, DCharman, SASupuran, CTPoulsen, SA Sulfonamide linked neoglycoconjugates--a new class of inhibitors for cancer-associated carbonic anhydrases. J Med Chem53:2913-26 (2010) 
 
Carbonic anhydrase 2
Name:Carbonic anhydrase 2
Type:Enzyme
Mol. Mass.:29250.71
Organism:Homo sapiens (Human)
Description:P00918
Residue:260
BDBM50314536
NameBDBM50314536
Synonyms:CHEMBL1092775 | N-4-(Aminosulfonyl)benzyl-S-(2,3,4,6-tetra-O-acetyl-1-thio-beta-D-galactopyranosyl)sulfenamide
TypeSmall organic molecule
Emp. Form.C21H28N2O11S2
Mol. Mass.548.584
SMILESCC(=O)OC[C@H]1O[C@@H](SNCc2ccc(cc2)S(N)(=O)=O)[C@H](OC(C)=O)[C@@H](OC(C)=O)[C@H]1OC(C)=O