Reaction Details
TargetCarbonic anhydrase 1
LigandBDBM50314547
Substrate/Competitorn/a
Meas. Tech.ChEMBL_625070 (CHEMBL1112519)
Ki 101±n/a nM
Citation Lopez, MBornaghi, LFInnocenti, AVullo, DCharman, SASupuran, CTPoulsen, SA Sulfonamide linked neoglycoconjugates--a new class of inhibitors for cancer-associated carbonic anhydrases. J Med Chem53:2913-26 (2010) 
 
Carbonic anhydrase 1
Name:Carbonic anhydrase 1
Type:Enzyme
Mol. Mass.:28873.37
Organism:Homo sapiens (Human)
Description:P00915
Residue:261
BDBM50314547
NameBDBM50314547
Synonyms:CHEMBL1089329 | N-4-(Aminosulfonyl)benzyl-S-(1-thio-beta-lactosyl)sulfonamide
TypeSmall organic molecule
Emp. Form.C19H30N2O14S2
Mol. Mass.574.577
SMILESNS(=O)(=O)c1ccc(CNS(=O)(=O)[C@@H]2O[C@H](CO)[C@@H](O[C@H]3O[C@H](CO)[C@@H](O)[C@H](O)[C@H]3O)[C@H](O)[C@H]2O)cc1