Reaction Details
TargetCarbonic anhydrase 9
LigandBDBM50314552
Substrate/Competitorn/a
Meas. Tech.ChEMBL_625072 (CHEMBL1112521)
Ki 105±n/a nM
Citation Lopez, MBornaghi, LFInnocenti, AVullo, DCharman, SASupuran, CTPoulsen, SA Sulfonamide linked neoglycoconjugates--a new class of inhibitors for cancer-associated carbonic anhydrases. J Med Chem53:2913-26 (2010) 
 
Carbonic anhydrase 9
Name:Carbonic anhydrase 9
Type:Enzyme
Mol. Mass.:49669.03
Organism:Homo sapiens (Human)
Description:Catalytic domain of human cloned isozyme was used in the assay
Residue:459
BDBM50314552
NameBDBM50314552
Synonyms:CHEMBL1089015 | N-4-(Aminosulfonyl)benzyl-S-(2,3,4,6-tetra-O-acetyl-1-thio-beta-D-glucopyranosyl)sulfenamide
TypeSmall organic molecule
Emp. Form.C21H28N2O11S2
Mol. Mass.548.584
SMILESCC(=O)OC[C@H]1O[C@@H](SNCc2ccc(cc2)S(N)(=O)=O)[C@H](OC(C)=O)[C@@H](OC(C)=O)[C@@H]1OC(C)=O