Reaction Details
TargetEctonucleotide pyrophosphatase/phosphodiesterase family member 2
LigandBDBM50079267
Substrate/Competitorn/a
Meas. Tech.ChEMBL_623313 (CHEMBL1115236)
IC50 1310±n/a nM
Citation North, EJHoward, ALWanjala, IWPham, TCBaker, DLParrill, AL Pharmacophore development and application toward the identification of novel, small-molecule autotaxin inhibitors. J Med Chem53:3095-105 (2010) 
 
Ectonucleotide pyrophosphatase/phosphodiesterase family member 2
Name:Ectonucleotide pyrophosphatase/phosphodiesterase family member 2
Type:Enzyme
Mol. Mass.:99007.13
Organism:Homo sapiens (Human)
Description:Q13822
Residue:863
BDBM50079267
NameBDBM50079267
Synonyms:Congo Red Kongorot disodium 3,3'-((1,1'-biphenyl)-4,4'-diylbis(azo))bis(4-aminonaphthalene-1-sulphonate) | disodium 3,3'-(biphenyl-4,4'-diyldidiazene-2,1-diyl)bis(4-aminonaphthalene-1-sulfonate)
TypeSmall organic molecule
Emp. Form.C32H22N6O6S2
Mol. Mass.650.685
SMILESNc1c(cc(c2ccccc12)S([O-])(=O)=O)\N=N\c1ccc(cc1)-c1ccc(cc1)\N=N\c1cc(c2ccccc2c1N)S([O-])(=O)=O