Reaction Details
TargetGlucocorticoid receptor
LigandBDBM50316561
Substrate/Competitorn/a
Meas. Tech.ChEMBL_631259 (CHEMBL1114666)
EC50 93±n/a nM
Citation Bai, MCarr, GDeorazio, RJFriedrich, TDDobritsa, SFitzpatrick, KGuzzo, PRKitchen, DBLynch, MAPeace, DSajad, MUsyatinsky, AWolf, MA 5-Functionalized indazoles as glucocorticoid receptor agonists. Bioorg Med Chem Lett20:3017-20 (2010) 
 
Glucocorticoid receptor
Name:Glucocorticoid receptor
Type:Enzyme
Mol. Mass.:85656.87
Organism:Homo sapiens (Human)
Description:P04150
Residue:777
BDBM50316561
NameBDBM50316561
Synonyms:1-(2-chloro-4-fluorophenyl)-2,2,2-trifluoro-1-(1-(4-fluorophenyl)-1H-indazol-5-yl)ethanol 1-(3-chloro-4-fluorophenyl)-2,2,2-trifluoro-1-(1-(4-fluorophenyl)-1H-indazol-5-yl)ethanol | CHEMBL1094231
TypeSmall organic molecule
Emp. Form.C21H12ClF5N2O
Mol. Mass.438.778
SMILESOC(c1ccc(F)c(Cl)c1)(c1ccc2n(ncc2c1)-c1ccc(F)cc1)C(F)(F)F