Reaction Details
TargetGlucocorticoid receptor
LigandBDBM50316555
Substrate/Competitorn/a
Meas. Tech.ChEMBL_631258 (CHEMBL1114665)
IC50 86.0±n/a nM
Citation Bai, MCarr, GDeorazio, RJFriedrich, TDDobritsa, SFitzpatrick, KGuzzo, PRKitchen, DBLynch, MAPeace, DSajad, MUsyatinsky, AWolf, MA 5-Functionalized indazoles as glucocorticoid receptor agonists. Bioorg Med Chem Lett20:3017-20 (2010) 
 
Glucocorticoid receptor
Name:Glucocorticoid receptor
Type:Enzyme
Mol. Mass.:85656.87
Organism:Homo sapiens (Human)
Description:P04150
Residue:777
BDBM50316555
NameBDBM50316555
Synonyms:2,2,2-trifluoro-1-(4-fluorophenyl)-1-(1-(4-fluorophenyl)-1H-indazol-5-yl)ethanol | 2,2,2-trifluoro-1-(4-fluorophenyl)-1-[1-(4-fluorophenyl)-1H-indazol-5-yl]ethan-1-ol
TypeSmall organic molecule
Emp. Form.C21H13F5N2O
Mol. Mass.404.3327
SMILESOC(c1ccc(F)cc1)(c1ccc2n(ncc2c1)-c1ccc(F)cc1)C(F)(F)F