Reaction Details
TargetPotassium voltage-gated channel subfamily H member 2
LigandBDBM50316567
Substrate/Competitorn/a
Meas. Tech.ChEMBL_631263 (CHEMBL1117343)
IC50>10000±n/a nM
Citation Bai, MCarr, GDeorazio, RJFriedrich, TDDobritsa, SFitzpatrick, KGuzzo, PRKitchen, DBLynch, MAPeace, DSajad, MUsyatinsky, AWolf, MA 5-Functionalized indazoles as glucocorticoid receptor agonists. Bioorg Med Chem Lett20:3017-20 (2010) 
 
Potassium voltage-gated channel subfamily H member 2
Name:Potassium voltage-gated channel subfamily H member 2
Type:Multi-pass membrane protein
Mol. Mass.:126672.65
Organism:Homo sapiens (Human)
Description:Q12809
Residue:1159
BDBM50316567
NameBDBM50316567
Synonyms:1-(2-chloropyridin-4-yl)-2,2,2-trifluoro-1-(1-(4-fluorophenyl)-1H-indazol-5-yl)ethanol | CHEMBL1094209
TypeSmall organic molecule
Emp. Form.C20H12ClF4N3O
Mol. Mass.421.775
SMILESOC(c1ccnc(Cl)c1)(c1ccc2n(ncc2c1)-c1ccc(F)cc1)C(F)(F)F