Reaction Details
TargetDelta-type opioid receptor
LigandBDBM50316610
Substrate/Competitorn/a
Meas. Tech.ChEMBL_631962 (CHEMBL1104718)
Ki>1000±n/a nM
Citation Geiger, CZelenka, CLehmkuhl, KSchepmann, DEnglberger, WWünsch, B Conformationally constrained kappa receptor agonists: stereoselective synthesis and pharmacological evaluation of 6,8-diazabicyclo[3.2.2]nonane derivatives. J Med Chem53:4212-22 (2010) 
 
Delta-type opioid receptor
Name:Delta-type opioid receptor
Type:G Protein-Coupled Receptor (GPCR)
Mol. Mass.:40382.98
Organism:Homo sapiens (Human)
Description:Competition binding assays were carried out using membrane preparations from transfected HN9.10 cells that constitutively expressed the delta opioid receptor.
Residue:372
BDBM50316610
NameBDBM50316610
Synonyms:(-)-1-{(1R,2R,5S)-8-[2-(3,4-Dichlorophenyl)acetyl]-2-(pyrrolidin-1-yl)-6,8-diazabicyclo[3.2.2]nonan-8-yl}propan-1-one | CHEMBL1094860
TypeSmall organic molecule
Emp. Form.C22H29Cl2N3O2
Mol. Mass.438.391
SMILESCCC(=O)N1C[C@@H]2[C@@H](CC[C@H]1CN2C(=O)Cc1ccc(Cl)c(Cl)c1)N1CCCC1