Reaction Details
TargetKappa-type opioid receptor
LigandBDBM50316622
Substrate/Competitorn/a
Meas. Tech.ChEMBL_631958 (CHEMBL1104714)
Ki 0.310000±n/a nM
Citation Geiger, CZelenka, CLehmkuhl, KSchepmann, DEnglberger, WWünsch, B Conformationally constrained kappa receptor agonists: stereoselective synthesis and pharmacological evaluation of 6,8-diazabicyclo[3.2.2]nonane derivatives. J Med Chem53:4212-22 (2010) 
 
Kappa-type opioid receptor
Name:Kappa-type opioid receptor
Type:G Protein-Coupled Receptor (GPCR)
Mol. Mass.:42744.99
Organism:Cavia porcellus (domestic guinea pig)
Description:P41144
Residue:380
BDBM50316622
NameBDBM50316622
Synonyms:(S)-methyl 4-(2-(3,4-dichlorophenyl)acetyl)-3-((S)-1-(pyrrolidin-1-yl)ethyl)piperazine-1-carboxylate | CHEMBL1094879
TypeSmall organic molecule
Emp. Form.C20H27Cl2N3O3
Mol. Mass.428.353
SMILESCOC(=O)N1CCN([C@@H](C1)[C@H](C)N1CCCC1)C(=O)Cc1ccc(Cl)c(Cl)c1