Reaction Details
TargetSigma non-opioid intracellular receptor 1
LigandBDBM81982
Substrate/Competitorn/a
Meas. Tech.ChEMBL_631967 (CHEMBL1104723)
Ki 61±n/a nM
Citation Geiger, CZelenka, CLehmkuhl, KSchepmann, DEnglberger, WWünsch, B Conformationally constrained kappa receptor agonists: stereoselective synthesis and pharmacological evaluation of 6,8-diazabicyclo[3.2.2]nonane derivatives. J Med Chem53:4212-22 (2010) 
 
Sigma non-opioid intracellular receptor 1
Name:Sigma non-opioid intracellular receptor 1
Type:Protein
Mol. Mass.:25307.17
Organism:Cavia porcellus (Guinea pig)
Description:Q60492
Residue:223
BDBM81982
NameBDBM81982
Synonyms:CAS_97-39-2 DTG Tol2Gdn | cid_7333
TypeSmall organic molecule
Emp. Form.C15H17N3
Mol. Mass.239.3156
SMILESCc1ccccc1NC(N)=Nc1ccccc1C