Reaction Details
TargetCarbonic anhydrase 4
LigandBDBM50317392
Substrate/Competitorn/a
Meas. Tech.ChEMBL_631615 (CHEMBL1106609)
IC50 783±n/a nM
Citation Vernier, WChong, WRewolinski, DGreasley, SPauly, TShaw, MDinh, DFerre, RAMeador, JWNukui, SOrnelas, MPaz, RLReyner, E Thioether benzenesulfonamide inhibitors of carbonic anhydrases II and IV: structure-based drug design, synthesis, and biological evaluation. Bioorg Med Chem18:3307-19 (2010) 
 
Carbonic anhydrase 4
Name:Carbonic anhydrase 4
Type:Enzyme
Mol. Mass.:35037.98
Organism:Homo sapiens (Human)
Description:P22748
Residue:312
BDBM50317392
NameBDBM50317392
Synonyms:5-(Aminosulfonyl)-2-(phenylthio)-N-(pyridin-2-ylmethyl)benzamide | CHEMBL1096820
TypeSmall organic molecule
Emp. Form.C19H17N3O3S2
Mol. Mass.399.487
SMILESNS(=O)(=O)c1ccc(Sc2ccccc2)c(c1)C(=O)NCc1ccccn1