Reaction Details
TargetCarbonic anhydrase 4
LigandBDBM50317393
Substrate/Competitorn/a
Meas. Tech.ChEMBL_631615 (CHEMBL1106609)
IC50 1910±n/a nM
Citation Vernier, WChong, WRewolinski, DGreasley, SPauly, TShaw, MDinh, DFerre, RAMeador, JWNukui, SOrnelas, MPaz, RLReyner, E Thioether benzenesulfonamide inhibitors of carbonic anhydrases II and IV: structure-based drug design, synthesis, and biological evaluation. Bioorg Med Chem18:3307-19 (2010) 
 
Carbonic anhydrase 4
Name:Carbonic anhydrase 4
Type:Enzyme
Mol. Mass.:35037.98
Organism:Homo sapiens (Human)
Description:P22748
Residue:312
BDBM50317393
NameBDBM50317393
Synonyms:5-(Aminosulfonyl)-N-(2-methoxyethyl)-2-[(2-phenylethyl)thio]benzamide | CHEMBL1096821
TypeSmall organic molecule
Emp. Form.C18H22N2O4S2
Mol. Mass.394.508
SMILESCOCCNC(=O)c1cc(ccc1SCCc1ccccc1)S(N)(=O)=O