Reaction Details
TargetCarbonic anhydrase 2
LigandBDBM50317402
Substrate/Competitorn/a
Meas. Tech.ChEMBL_631614 (CHEMBL1106608)
IC50 26.6±n/a nM
Citation Vernier, WChong, WRewolinski, DGreasley, SPauly, TShaw, MDinh, DFerre, RAMeador, JWNukui, SOrnelas, MPaz, RLReyner, E Thioether benzenesulfonamide inhibitors of carbonic anhydrases II and IV: structure-based drug design, synthesis, and biological evaluation. Bioorg Med Chem18:3307-19 (2010) 
 
Carbonic anhydrase 2
Name:Carbonic anhydrase 2
Type:Enzyme
Mol. Mass.:29250.71
Organism:Homo sapiens (Human)
Description:P00918
Residue:260
BDBM50317402
NameBDBM50317402
Synonyms:5-(Aminosulfonyl)-N-(2-phenylethyl)-2-(phenylthio)-nicotinamide N-(2-phenylethyl)-2-(phenylsulfanyl)-5-sulfamoylpyridine-3-carboxamide
TypeSmall organic molecule
Emp. Form.C20H19N3O3S2
Mol. Mass.413.513
SMILESNS(=O)(=O)c1cnc(Sc2ccccc2)c(c1)C(=O)NCCc1ccccc1