Reaction Details
TargetCarbonic anhydrase 4
LigandBDBM50317412
Substrate/Competitorn/a
Meas. Tech.ChEMBL_631615 (CHEMBL1106609)
IC50 1230±n/a nM
Citation Vernier, WChong, WRewolinski, DGreasley, SPauly, TShaw, MDinh, DFerre, RAMeador, JWNukui, SOrnelas, MPaz, RLReyner, E Thioether benzenesulfonamide inhibitors of carbonic anhydrases II and IV: structure-based drug design, synthesis, and biological evaluation. Bioorg Med Chem18:3307-19 (2010) 
 
Carbonic anhydrase 4
Name:Carbonic anhydrase 4
Type:Enzyme
Mol. Mass.:35037.98
Organism:Homo sapiens (Human)
Description:P22748
Residue:312
BDBM50317412
NameBDBM50317412
Synonyms:6-[(3,4-Difluorophenyl)thio]-5-(hydroxymethyl)-pyridine-3-sulfonamide | CHEMBL1098657
TypeSmall organic molecule
Emp. Form.C12H10F2N2O3S2
Mol. Mass.332.346
SMILESNS(=O)(=O)c1cnc(Sc2ccc(F)c(F)c2)c(CO)c1