Reaction Details
TargetCarbonic anhydrase 4
LigandBDBM50317417
Substrate/Competitorn/a
Meas. Tech.ChEMBL_631615 (CHEMBL1106609)
IC50 1250±n/a nM
Citation Vernier, WChong, WRewolinski, DGreasley, SPauly, TShaw, MDinh, DFerre, RAMeador, JWNukui, SOrnelas, MPaz, RLReyner, E Thioether benzenesulfonamide inhibitors of carbonic anhydrases II and IV: structure-based drug design, synthesis, and biological evaluation. Bioorg Med Chem18:3307-19 (2010) 
 
Carbonic anhydrase 4
Name:Carbonic anhydrase 4
Type:Enzyme
Mol. Mass.:35037.98
Organism:Homo sapiens (Human)
Description:P22748
Residue:312
BDBM50317417
NameBDBM50317417
Synonyms:5-(Aminosulfonyl)-N-ethyl-3-fluoro-2-(isobutylthio)-benzamide | CHEMBL1095883
TypeSmall organic molecule
Emp. Form.C13H19FN2O3S2
Mol. Mass.334.43
SMILESCCNC(=O)c1cc(cc(F)c1SCC(C)C)S(N)(=O)=O