Reaction Details
TargetOrexin receptor type 2
LigandBDBM50318697
Substrate/Competitorn/a
Meas. Tech.ChEMBL_633510 (CHEMBL1119824)
Ki 0.17±n/a nM
Citation Cox, CDBreslin, MJWhitman, DBSchreier, JDMcGaughey, GBBogusky, MJRoecker, AJMercer, SPBednar, RALemaire, WBruno, JGReiss, DRHarrell, CMMurphy, KLGarson, SLDoran, SMPrueksaritanont, TAnderson, WBTang, CRoller, SCabalu, TDCui, DHartman, GDYoung, SDKoblan, KSWinrow, CJRenger, JJColeman, PJ Discovery of the dual orexin receptor antagonist [(7R)-4-(5-chloro-1,3-benzoxazol-2-yl)-7-methyl-1,4-diazepan-1-yl][5-methyl-2-(2H-1,2,3-triazol-2-yl)phenyl]methanone (MK-4305) for the treatment of insomnia. J Med Chem53:5320-32 (2010) 
 
Orexin receptor type 2
Name:Orexin receptor type 2
Type:Protein
Mol. Mass.:50710.53
Organism:Homo sapiens (Human)
Description:O43614
Residue:444
BDBM50318697
NameBDBM50318697
Synonyms:6-Fluoro-2-{(5R)-5-Methyl-4-[5-methyl-2-(2H-1,2,3-triazol-2-yl)benzoyl]-1,4-diazepan-1-yl}quinazoline | CHEMBL1083358
TypeSmall organic molecule
Emp. Form.C23H22FN7O
Mol. Mass.431.4655
SMILESC[C@@H]1CCN(CCN1C(=O)c1ccccc1-n1nccn1)c1ncc2cc(F)ccc2n1