Reaction Details
TargetAcetylcholinesterase
LigandBDBM50318705
Substrate/Competitorn/a
Meas. Tech.ChEMBL_633736 (CHEMBL1119107)
IC50 93±n/a nM
Citation de Los Ríos, CEgea, JMarco-Contelles, JLeón, RSamadi, AIriepa, IMoraleda, IGálvez, EGarcía, AGLópez, MGVillarroya, MRomero, A Synthesis, inhibitory activity of cholinesterases, and neuroprotective profile of novel 1,8-naphthyridine derivatives. J Med Chem53:5129-43 (2010) 
 
Acetylcholinesterase
Name:Acetylcholinesterase
Type:Enzyme
Mol. Mass.:67659.62
Organism:Bos taurus (bovine)
Description:n/a
Residue:613
BDBM50318705
NameBDBM50318705
Synonyms:CHEMBL1086184 | Methyl 5-Amino-2-methyl-6,7,8,9-tetrahydrobenzo[b][1,8]naphthyridine-3-carboxylate
TypeSmall organic molecule
Emp. Form.C15H17N3O2
Mol. Mass.271.3144
SMILESCOC(=O)c1cc2c(N)c3CCCCc3nc2nc1C