Reaction Details
TargetCruzipain
LigandBDBM50366785
Substrate/Competitorn/a
Meas. Tech.ChEMBL_635150 (CHEMBL1119972)
IC50>300000±n/a nM
Citation Doak, AKWille, HPrusiner, SBShoichet, BK Colloid formation by drugs in simulated intestinal fluid. J Med Chem53:4259-65 (2010) 
 
Cruzipain
Name:Cruzipain
Type:Protein
Mol. Mass.:49831.41
Organism:Trypanosoma cruzi
Description:P25779
Residue:467
BDBM50366785
NameBDBM50366785
Synonyms:NELFINAVIR
TypeSmall organic molecule
Emp. Form.C32H45N3O4S
Mol. Mass.567.782
SMILESCc1c(O)cccc1C(=O)N[C@H](CSc1ccccc1)[C@H](O)CN1C[C@H]2CCCC[C@H]2C[C@H]1C(=O)NC(C)(C)C