Reaction Details
TargetCarbonic anhydrase 13
LigandBDBM50167367
Substrate/Competitorn/a
Meas. Tech.ChEMBL_635039 (CHEMBL1118590)
Ki 994±n/a nM
Citation Di Fiore, AMonti, SMInnocenti, AWinum, JYDe Simone, GSupuran, CT Carbonic anhydrase inhibitors: crystallographic and solution binding studies for the interaction of a boron-containing aromatic sulfamide with mammalian isoforms I-XV. Bioorg Med Chem Lett20:3601-5 (2010) 
 
Carbonic anhydrase 13
Name:Carbonic anhydrase 13
Type:Enzyme
Mol. Mass.:29522.80
Organism:Mus musculus (mouse)
Description:Murine cloned isozyme
Residue:262
BDBM50167367
NameBDBM50167367
Synonyms:(4,4,5,5-tetramethyl-1,3,2-dioxaborolan-2-yl)phenylsulfamide N-[4-(4,4,5,5-tetramethyl-1,3,2-dioxaborolan-2-yl)phenyl]aminosulfonamide | N-[4-(4,4,5,5-tetramethyl-1,3,2-dioxaborolan-2-yl)phenyl]sulfamide
TypeSmall organic molecule
Emp. Form.C12H19BN2O4S
Mol. Mass.298.166
SMILESCC1(C)OB(OC1(C)C)c1ccc(NS(N)(=O)=O)cc1