Reaction Details
TargetAndrogen receptor
LigandBDBM50321202
Substrate/Competitorn/a
Meas. Tech.ChEMBL_637915 (CHEMBL1169306)
Ki 2.3±n/a nM
Citation Du, YLi, QXiong, BHui, XWang, XFeng, YMeng, THu, DZhang, DWang, MShen, J Aromatic beta-amino-ketone derivatives as novel selective non-steroidal progesterone receptor antagonists. Bioorg Med Chem18:4255-68 (2010) 
 
Androgen receptor
Name:Androgen receptor
Type:Receptor
Mol. Mass.:99185.27
Organism:Homo sapiens (Human)
Description:CHO cells were stably transfected with human AR gene.
Residue:920
BDBM50321202
NameBDBM50321202
Synonyms:CHEMBL1163602 | rac-3-(4-Nitrophenylamino)-1-(4-cyanophenyl)-3-(thiophen-3-yl)propan-1-one
TypeSmall organic molecule
Emp. Form.C20H15N3O3S
Mol. Mass.377.416
SMILES[O-][N+](=O)c1ccc(NC(CC(=O)c2ccc(cc2)C#N)c2ccsc2)cc1