Reaction Details
TargetOrexin receptor type 2
LigandBDBM50321509
Substrate/Competitorn/a
Meas. Tech.ChEMBL_639602 (CHEMBL1175135)
Ki 0.6±n/a nM
Citation Coleman, PJSchreier, JDRoecker, AJMercer, SPMcGaughey, GBCox, CDHartman, GDHarrell, CMReiss, DRDoran, SMGarson, SLAnderson, WBTang, CPrueksaritanont, TWinrow, CJRenger, JJ Discovery of 3,9-diazabicyclo[4.2.1]nonanes as potent dual orexin receptor antagonists with sleep-promoting activity in the rat. Bioorg Med Chem Lett20:4201-5 (2010) 
 
Orexin receptor type 2
Name:Orexin receptor type 2
Type:Protein
Mol. Mass.:50710.53
Organism:Homo sapiens (Human)
Description:O43614
Residue:444
BDBM50321509
NameBDBM50321509
Synonyms:(5-chloro-2-(2H-1,2,3-triazol-2-yl)phenyl)((1R,5R)-6-(6-fluoroquinazolin-2-yl)-3,6-diazabicyclo[3.2.1]octan-3-yl)methanone | CHEMBL1172520
TypeSmall organic molecule
Emp. Form.C23H19ClFN7O
Mol. Mass.463.895
SMILESFc1ccc2nc(ncc2c1)N1C[C@H]2C[C@@H]1CN(C2)C(=O)c1cc(Cl)ccc1-n1nccn1