Reaction Details
TargetOrexin receptor type 2
LigandBDBM50321515
Substrate/Competitorn/a
Meas. Tech.ChEMBL_639600 (CHEMBL1175133)
IC50>10000±n/a nM
Citation Coleman, PJSchreier, JDRoecker, AJMercer, SPMcGaughey, GBCox, CDHartman, GDHarrell, CMReiss, DRDoran, SMGarson, SLAnderson, WBTang, CPrueksaritanont, TWinrow, CJRenger, JJ Discovery of 3,9-diazabicyclo[4.2.1]nonanes as potent dual orexin receptor antagonists with sleep-promoting activity in the rat. Bioorg Med Chem Lett20:4201-5 (2010) 
 
Orexin receptor type 2
Name:Orexin receptor type 2
Type:Protein
Mol. Mass.:50710.53
Organism:Homo sapiens (Human)
Description:O43614
Residue:444
BDBM50321515
NameBDBM50321515
Synonyms:((1R,5R)-6-(7-fluoroquinazolin-2-yl)-2,6-diazabicyclo[3.2.2]nonan-2-yl)(5-methyl-2-(2H-1,2,3-triazol-2-yl)phenyl)methanone | CHEMBL1171767
TypeSmall organic molecule
Emp. Form.C25H24FN7O
Mol. Mass.457.5028
SMILESCc1ccc(c(c1)C(=O)N1CC[C@H]2CC[C@@H]1CN2c1ncc2ccc(F)cc2n1)-n1nccn1