Reaction Details
TargetAdenosine receptor A2b
LigandBDBM50321522
Substrate/Competitorn/a
Meas. Tech.ChEMBL_639627 (CHEMBL1175305)
IC50 6±n/a nM
Citation Cheung, AWBrinkman, JFirooznia, FFlohr, AGrimsby, JGubler, MLGuertin, KHamid, RMarcopulos, NNorcross, RDQi, LRamsey, GTan, JWen, YSarabu, R 4-Substituted-7-N-alkyl-N-acetyl 2-aminobenzothiazole amides: drug-like and non-xanthine based A2B adenosine receptor antagonists. Bioorg Med Chem Lett20:4140-6 (2010) 
 
Adenosine receptor A2b
Name:Adenosine receptor A2b
Type:G Protein-Coupled Receptor (GPCR)
Mol. Mass.:36341.22
Organism:Homo sapiens (Human)
Description:n/a
Residue:332
BDBM50321522
NameBDBM50321522
Synonyms:CHEMBL1171164 | N-(7-(N-ethylacetamido)-4-methoxybenzo[d]thiazol-2-yl)-1-(3-(trifluoromethyl)benzyl)-1H-pyrazole-4-carboxamide
TypeSmall organic molecule
Emp. Form.C24H22F3N5O3S
Mol. Mass.517.523
SMILESCCN(C(C)=O)c1ccc(OC)c2nc(NC(=O)c3cnn(Cc4cccc(c4)C(F)(F)F)c3)sc12