Reaction Details
TargetAdenosine receptor A2a
LigandBDBM50321533
Substrate/Competitorn/a
Meas. Tech.ChEMBL_639629 (CHEMBL1175307)
Ki 5±n/a nM
Citation Cheung, AWBrinkman, JFirooznia, FFlohr, AGrimsby, JGubler, MLGuertin, KHamid, RMarcopulos, NNorcross, RDQi, LRamsey, GTan, JWen, YSarabu, R 4-Substituted-7-N-alkyl-N-acetyl 2-aminobenzothiazole amides: drug-like and non-xanthine based A2B adenosine receptor antagonists. Bioorg Med Chem Lett20:4140-6 (2010) 
 
Adenosine receptor A2a
Name:Adenosine receptor A2a
Type:G Protein-Coupled Receptor (GPCR)
Mol. Mass.:44716.46
Organism:Homo sapiens (Human)
Description:P29274
Residue:412
BDBM50321533
NameBDBM50321533
Synonyms:CHEMBL1171525 | methyl 2-(N-(2-(4-fluorobenzamido)-4-methoxybenzo[d]thiazol-7-yl)acetamido)acetate
TypeSmall organic molecule
Emp. Form.C20H18FN3O5S
Mol. Mass.431.437
SMILESCOC(=O)CN(C(C)=O)c1ccc(OC)c2nc(NC(=O)c3ccc(F)cc3)sc12