Reaction Details
TargetAdenosine receptor A2b
LigandBDBM50321549
Substrate/Competitorn/a
Meas. Tech.ChEMBL_639630 (CHEMBL1175308)
Ki 7±n/a nM
Citation Cheung, AWBrinkman, JFirooznia, FFlohr, AGrimsby, JGubler, MLGuertin, KHamid, RMarcopulos, NNorcross, RDQi, LRamsey, GTan, JWen, YSarabu, R 4-Substituted-7-N-alkyl-N-acetyl 2-aminobenzothiazole amides: drug-like and non-xanthine based A2B adenosine receptor antagonists. Bioorg Med Chem Lett20:4140-6 (2010) 
 
Adenosine receptor A2b
Name:Adenosine receptor A2b
Type:G Protein-Coupled Receptor (GPCR)
Mol. Mass.:36341.22
Organism:Homo sapiens (Human)
Description:n/a
Residue:332
BDBM50321549
NameBDBM50321549
Synonyms:CHEMBL1170134 | N-(7-(N-ethylacetamido)-4-methoxybenzo[d]thiazol-2-yl)-4-(morpholine-4-carbonyl)benzamide
TypeSmall organic molecule
Emp. Form.C24H26N4O5S
Mol. Mass.482.552
SMILESCCN(C(C)=O)c1ccc(OC)c2nc(NC(=O)c3ccc(cc3)C(=O)N3CCOCC3)sc12