Reaction Details
TargetHistamine H3 receptor
LigandBDBM50321817
Substrate/Competitorn/a
Meas. Tech.ChEMBL_643311 (CHEMBL1177482)
Ki>1000±n/a nM
Citation Ishikawa, MFuruuchi, TYamauchi, MYokoyama, FKakui, NSato, Y Synthesis and structure-activity relationships of N-aryl-piperidine derivatives as potent (partial) agonists for human histamine H3 receptor. Bioorg Med Chem18:5441-8 (2010) 
 
Histamine H3 receptor
Name:Histamine H3 receptor
Type:G Protein-Coupled Receptor (GPCR)
Mol. Mass.:48691.47
Organism:Homo sapiens (Human)
Description:Binding assays were using CHO cells stably expressing hH3R receptors.
Residue:445
BDBM50321817
NameBDBM50321817
Synonyms:1-((1H-Imidazol-4-yl)methyl)-4-phenylpiperazine | CHEMBL1173032
TypeSmall organic molecule
Emp. Form.C14H18N4
Mol. Mass.242.3195
SMILESC(N1CCN(CC1)c1ccccc1)c1cnc[nH]1