Reaction Details
TargetHistamine H3 receptor
LigandBDBM50321815
Substrate/Competitorn/a
Meas. Tech.ChEMBL_643312 (CHEMBL1177483)
EC50 1.1±n/a nM
Citation Ishikawa, MFuruuchi, TYamauchi, MYokoyama, FKakui, NSato, Y Synthesis and structure-activity relationships of N-aryl-piperidine derivatives as potent (partial) agonists for human histamine H3 receptor. Bioorg Med Chem18:5441-8 (2010) 
 
Histamine H3 receptor
Name:Histamine H3 receptor
Type:G Protein-Coupled Receptor (GPCR)
Mol. Mass.:48691.47
Organism:Homo sapiens (Human)
Description:Binding assays were using CHO cells stably expressing hH3R receptors.
Residue:445
BDBM50321815
NameBDBM50321815
Synonyms:4-((1H-Imidazol-4-yl)methyl)-1-(4-(trifluoromethyl)-phenyl)piperidine | CHEMBL1172754
TypeSmall organic molecule
Emp. Form.C16H18F3N3
Mol. Mass.309.3294
SMILESFC(F)(F)c1ccc(cc1)N1CCC(Cc2cnc[nH]2)CC1