Reaction Details
TargetHistamine H3 receptor
LigandBDBM50321816
Substrate/Competitorn/a
Meas. Tech.ChEMBL_643312 (CHEMBL1177483)
EC50 7.6±n/a nM
Citation Ishikawa, MFuruuchi, TYamauchi, MYokoyama, FKakui, NSato, Y Synthesis and structure-activity relationships of N-aryl-piperidine derivatives as potent (partial) agonists for human histamine H3 receptor. Bioorg Med Chem18:5441-8 (2010) 
 
Histamine H3 receptor
Name:Histamine H3 receptor
Type:G Protein-Coupled Receptor (GPCR)
Mol. Mass.:48691.47
Organism:Homo sapiens (Human)
Description:Binding assays were using CHO cells stably expressing hH3R receptors.
Residue:445
BDBM50321816
NameBDBM50321816
Synonyms:4-((1H-Imidazol-4-yl)methyl)-1-(4-methoxyphenyl)piperidine | CHEMBL1172775
TypeSmall organic molecule
Emp. Form.C16H21N3O
Mol. Mass.271.3574
SMILESCOc1ccc(cc1)N1CCC(Cc2cnc[nH]2)CC1