Reaction Details
TargetTransient receptor potential cation channel subfamily V member 1
LigandBDBM50321851
Substrate/Competitorn/a
Meas. Tech.ChEMBL_641610 (CHEMBL1176312)
IC50 15±n/a nM
Citation Perner, RJKoenig, JRDidomenico, SGomtsyan, ASchmidt, RGLee, CHHsu, MCMcDonald, HAGauvin, DMJoshi, STurner, TMReilly, RMKym, PRKort, ME Synthesis and biological evaluation of 5-substituted and 4,5-disubstituted-2-arylamino oxazole TRPV1 antagonists. Bioorg Med Chem18:4821-9 (2011) 
 
Transient receptor potential cation channel subfamily V member 1
Name:Transient receptor potential cation channel subfamily V member 1
Type:Protein
Mol. Mass.:94960.75
Organism:Homo sapiens (Human)
Description:Q8NER1
Residue:839
BDBM50321851
NameBDBM50321851
Synonyms:(R)-8-{5-[3-Methyl-4-(trifluoromethyl)phenyl]oxazol-2-ylamino}-1,2,3,4-tetrahydronaphthalen-2-ol US8796328, D
TypeSmall organic molecule
Emp. Form.C21H19F3N2O2
Mol. Mass.388.383
SMILESCc1nc(Nc2cccc3CC[C@@H](O)Cc23)oc1-c1ccc(cc1)C(F)(F)F