Reaction Details
TargetTransient receptor potential cation channel subfamily V member 1
LigandBDBM50321853
Substrate/Competitorn/a
Meas. Tech.ChEMBL_641610 (CHEMBL1176312)
IC50 2.1±n/a nM
Citation Perner, RJKoenig, JRDidomenico, SGomtsyan, ASchmidt, RGLee, CHHsu, MCMcDonald, HAGauvin, DMJoshi, STurner, TMReilly, RMKym, PRKort, ME Synthesis and biological evaluation of 5-substituted and 4,5-disubstituted-2-arylamino oxazole TRPV1 antagonists. Bioorg Med Chem18:4821-9 (2011) 
 
Transient receptor potential cation channel subfamily V member 1
Name:Transient receptor potential cation channel subfamily V member 1
Type:Protein
Mol. Mass.:94960.75
Organism:Homo sapiens (Human)
Description:Q8NER1
Residue:839
BDBM50321853
NameBDBM50321853
Synonyms:8-{4-Ethyl-5-[4-(trifluoromethyl)phenyl]oxazol-2-ylamino}-1,2,3,4-tetrahydronaphthalen-2-ol | CHEMBL1173242
TypeSmall organic molecule
Emp. Form.C22H21F3N2O2
Mol. Mass.402.4095
SMILESCCc1nc(Nc2cccc3CCC(O)Cc23)oc1-c1ccc(cc1)C(F)(F)F