Reaction Details
Target5-hydroxytryptamine receptor 2C
LigandBDBM50108306
Substrate/Competitorn/a
Meas. Tech.ChEMBL_642099 (CHEMBL1176403)
Ki 1±n/a nM
Citation Cummings, DFCanseco, DCSheth, PJohnson, JESchetz, JA Synthesis and structure-affinity relationships of novel small molecule natural product derivatives capable of discriminating between serotonin 5-HT1A, 5-HT2A, 5-HT2C receptor subtypes. Bioorg Med Chem18:4783-92 (2011) 
 
5-hydroxytryptamine receptor 2C
Name:5-hydroxytryptamine receptor 2C
Type:G Protein-Coupled Receptor (GPCR)
Mol. Mass.:51836.79
Organism:Homo sapiens (Human)
Description:P28335
Residue:458
BDBM50108306
NameBDBM50108306
Synonyms:(S)-1-(5,6-difluoro-1H-indol-1-yl)propan-2-amine CHEMBL40726
TypeSmall organic molecule
Emp. Form.C11H12F2N2
Mol. Mass.210.2232
SMILESC[C@H](N)Cn1ccc2cc(F)c(F)cc12