Reaction Details
TargetKiSS-1 receptor
LigandBDBM50322319
Substrate/Competitorn/a
Meas. Tech.ChEMBL_642624 (CHEMBL1176639)
IC50 9.7±n/a nM
Citation Kobayashi, TSasaki, STomita, NFukui, SNakayama, MKiba, AKusaka, MMatsumoto, SYamaguchi, MItoh, FBaba, A 2-acylamino-4,6-diphenylpyridine derivatives as novel GPR54 antagonists with good brain exposure and in vivo efficacy for plasma LH level in male rats. Bioorg Med Chem18:5157-71 (2010) 
 
KiSS-1 receptor
Name:KiSS-1 receptor
Type:G Protein-Coupled Receptor (GPCR)
Mol. Mass.:42613.79
Organism:Homo sapiens (Human)
Description:Binding assay was performed using membranes from the CHO cell transfectants.
Residue:398
BDBM50322319
NameBDBM50322319
Synonyms:CHEMBL1170692 | rac-N-{3-Cyano-6-(4-fluoro-2-hydroxyphenyl)-4-[3-({3-[(1-methylethyl)amino]butanoyl}amino)phenyl]pyridin-2-yl}furan-2-carboxamide
TypeSmall organic molecule
Emp. Form.C30H28FN5O4
Mol. Mass.541.5728
SMILESCC(C)NC(C)CC(=O)Nc1cccc(c1)-c1cc(nc(NC(=O)c2ccco2)c1C#N)-c1ccc(F)cc1O