Reaction Details
TargetKiSS-1 receptor
LigandBDBM50322299
Substrate/Competitorn/a
Meas. Tech.ChEMBL_642624 (CHEMBL1176639)
IC50 3.6±n/a nM
Citation Kobayashi, TSasaki, STomita, NFukui, SNakayama, MKiba, AKusaka, MMatsumoto, SYamaguchi, MItoh, FBaba, A 2-acylamino-4,6-diphenylpyridine derivatives as novel GPR54 antagonists with good brain exposure and in vivo efficacy for plasma LH level in male rats. Bioorg Med Chem18:5157-71 (2010) 
 
KiSS-1 receptor
Name:KiSS-1 receptor
Type:G Protein-Coupled Receptor (GPCR)
Mol. Mass.:42613.79
Organism:Homo sapiens (Human)
Description:Binding assay was performed using membranes from the CHO cell transfectants.
Residue:398
BDBM50322299
NameBDBM50322299
Synonyms:CHEMBL1173643 | N-[3-Cyano-6-(4-fluoro-2-hydroxyphenyl)-4-(3-piperazin-1-ylphenyl)pyridin-2-yl]furan-2-carboxamide
TypeSmall organic molecule
Emp. Form.C27H22FN5O3
Mol. Mass.483.4937
SMILESOc1cc(F)ccc1-c1cc(-c2cccc(c2)N2CCNCC2)c(C#N)c(NC(=O)c2ccco2)n1