Reaction Details
TargetKiSS-1 receptor
LigandBDBM50322303
Substrate/Competitorn/a
Meas. Tech.ChEMBL_642624 (CHEMBL1176639)
IC50 9.7±n/a nM
Citation Kobayashi, TSasaki, STomita, NFukui, SNakayama, MKiba, AKusaka, MMatsumoto, SYamaguchi, MItoh, FBaba, A 2-acylamino-4,6-diphenylpyridine derivatives as novel GPR54 antagonists with good brain exposure and in vivo efficacy for plasma LH level in male rats. Bioorg Med Chem18:5157-71 (2010) 
 
KiSS-1 receptor
Name:KiSS-1 receptor
Type:G Protein-Coupled Receptor (GPCR)
Mol. Mass.:42613.79
Organism:Homo sapiens (Human)
Description:Binding assay was performed using membranes from the CHO cell transfectants.
Residue:398
BDBM50322303
NameBDBM50322303
Synonyms:CHEMBL1170870 | N-{3-Cyano-6-(4-fluoro-2-hydroxyphenyl)-4-[3-(piperazin-1-ylmethyl)phenyl]pyridin-2-yl}furan-2-carbox-amide trifluoroacetate
TypeSmall organic molecule
Emp. Form.C28H24FN5O3
Mol. Mass.497.5203
SMILESOc1cc(F)ccc1-c1cc(-c2cccc(CN3CCNCC3)c2)c(C#N)c(NC(=O)c2ccco2)n1