Reaction Details
TargetKiSS-1 receptor
LigandBDBM50322309
Substrate/Competitorn/a
Meas. Tech.ChEMBL_642625 (CHEMBL1176768)
IC50 26±n/a nM
Citation Kobayashi, TSasaki, STomita, NFukui, SNakayama, MKiba, AKusaka, MMatsumoto, SYamaguchi, MItoh, FBaba, A 2-acylamino-4,6-diphenylpyridine derivatives as novel GPR54 antagonists with good brain exposure and in vivo efficacy for plasma LH level in male rats. Bioorg Med Chem18:5157-71 (2010) 
 
KiSS-1 receptor
Name:KiSS-1 receptor
Type:PROTEIN
Mol. Mass.:42915.37
Organism:Rattus norvegicus
Description:ChEMBL_1448383
Residue:396
BDBM50322309
NameBDBM50322309
Synonyms:CHEMBL1170903 | N-[3-Cyano-6-(4-fluoro-2-hydroxyphenyl)-4-(3-{[(2S)-pyrrolidin-2-ylacetyl]amino}phenyl)pyridin-2-yl]furan-2-carboxamide
TypeSmall organic molecule
Emp. Form.C29H24FN5O4
Mol. Mass.525.5304
SMILESOc1cc(F)ccc1-c1cc(-c2cccc(NC(=O)C[C@@H]3CCCN3)c2)c(C#N)c(NC(=O)c2ccco2)n1