Reaction Details
TargetCarbonic anhydrase 9
LigandBDBM50263373
Substrate/Competitorn/a
Meas. Tech.ChEMBL_642828 (CHEMBL1177458)
Ki 87±n/a nM
Citation Wagner, JAvvaru, BSRobbins, AHScozzafava, ASupuran, CTMcKenna, R Coumarinyl-substituted sulfonamides strongly inhibit several human carbonic anhydrase isoforms: solution and crystallographic investigations. Bioorg Med Chem18:4873-8 (2010) 
 
Carbonic anhydrase 9
Name:Carbonic anhydrase 9
Type:Enzyme
Mol. Mass.:49669.03
Organism:Homo sapiens (Human)
Description:Catalytic domain of human cloned isozyme was used in the assay
Residue:459
BDBM50263373
NameBDBM50263373
Synonyms:2-(7-Methoxy-2-oxo-2H-chromen-4-yl)-N-(4-sulfamoyl-phenyl)-acetamide CHEMBL477822
TypeSmall organic molecule
Emp. Form.C18H16N2O6S
Mol. Mass.388.394
SMILESCOc1ccc2c(CC(=O)Nc3ccc(cc3)S(N)(=O)=O)cc(=O)oc2c1