Reaction Details
TargetCarbonic anhydrase 12
LigandBDBM50263939
Substrate/Competitorn/a
Meas. Tech.ChEMBL_642829 (CHEMBL1177459)
Ki 55±n/a nM
Citation Wagner, JAvvaru, BSRobbins, AHScozzafava, ASupuran, CTMcKenna, R Coumarinyl-substituted sulfonamides strongly inhibit several human carbonic anhydrase isoforms: solution and crystallographic investigations. Bioorg Med Chem18:4873-8 (2010) 
 
Carbonic anhydrase 12
Name:Carbonic anhydrase 12
Type:Enzyme
Mol. Mass.:39456.00
Organism:Homo sapiens (Human)
Description:Catalytic domain of human cloned isozyme was used in the assay
Residue:354
BDBM50263939
NameBDBM50263939
Synonyms:2-(7-Methoxy-2-oxo-2H-chromen-4-yl)-N-(3-sulfamoyl-phenyl)-acetamide CHEMBL492022
TypeSmall organic molecule
Emp. Form.C18H16N2O6S
Mol. Mass.388.394
SMILESCOc1ccc2c(CC(=O)Nc3cccc(c3)S(N)(=O)=O)cc(=O)oc2c1