Reaction Details
TargetCarbonic anhydrase 1
LigandBDBM50263418
Substrate/Competitorn/a
Meas. Tech.ChEMBL_642826 (CHEMBL1177456)
Ki 131±n/a nM
Citation Wagner, JAvvaru, BSRobbins, AHScozzafava, ASupuran, CTMcKenna, R Coumarinyl-substituted sulfonamides strongly inhibit several human carbonic anhydrase isoforms: solution and crystallographic investigations. Bioorg Med Chem18:4873-8 (2010) 
 
Carbonic anhydrase 1
Name:Carbonic anhydrase 1
Type:Enzyme
Mol. Mass.:28873.37
Organism:Homo sapiens (Human)
Description:P00915
Residue:261
BDBM50263418
NameBDBM50263418
Synonyms:2-(7-Methoxy-2-oxo-2H-chromen-4-yl)-N-(2-sulfamoyl-phenyl)-acetamide CHEMBL514556
TypeSmall organic molecule
Emp. Form.C18H16N2O6S
Mol. Mass.388.394
SMILESCOc1ccc2c(CC(=O)Nc3ccccc3S(N)(=O)=O)cc(=O)oc2c1