Reaction Details
TargetPeroxisome proliferator-activated receptor gamma
LigandBDBM50322695
Substrate/Competitorn/a
Meas. Tech.ChEMBL_642078 (CHEMBL1176110)
IC50 1770±n/a nM
Citation Seto, SOkada, KKiyota, KIsogai, SIwago, MShinozaki, TKitamura, YKohno, YMurakami, K Design, synthesis, and structure-activity relationship studies of novel 2,4,6-trisubstituted-5-pyrimidinecarboxylic acids as peroxisome proliferator-activated receptor gamma (PPARgamma) partial agonists with comparable antidiabetic efficacy to rosiglitazone. J Med Chem53:5012-24 (2010) 
 
Peroxisome proliferator-activated receptor gamma
Name:Peroxisome proliferator-activated receptor gamma
Type:PROTEIN
Mol. Mass.:57593.55
Organism:Mus musculus
Description:ChEMBL_1453700
Residue:505
BDBM50322695
NameBDBM50322695
Synonyms:4,6-Bis(benzylthio)-2-(methylthio)pyrimidine-5-carboxylic Acid | CHEMBL1172425
TypeSmall organic molecule
Emp. Form.C20H18N2O2S3
Mol. Mass.414.564
SMILESCSc1nc(SCc2ccccc2)c(C(O)=O)c(SCc2ccccc2)n1