Reaction Details
TargetDNA topoisomerase 1
LigandBDBM50326187
Substrate/Competitorn/a
Meas. Tech.ChEMBL_659083 (CHEMBL1246696)
IC50 7200±n/a nM
Citation Tseng, CHTzeng, CCYang, CLLu, PJChen, HLLi, HYChuang, YCYang, CNChen, YL Synthesis and antiproliferative evaluation of certain indeno[1,2-c]quinoline derivatives. Part 2. J Med Chem53:6164-79 (2010) 
 
DNA topoisomerase 1
Name:DNA topoisomerase 1
Type:Enzyme
Mol. Mass.:90771.02
Organism:Homo sapiens (Human)
Description:P11387
Residue:765
BDBM50326187
NameBDBM50326187
Synonyms:(E)-9-Methoxy-11H-indeno[1,2-c]quinolin-11-oneO-2-(dimethylamino)ethylOxime | CHEMBL1243107
TypeSmall organic molecule
Emp. Form.C21H21N3O2
Mol. Mass.347.4103
SMILESCOc1ccc-2c(c1)\C(=N/OCCN(C)C)c1c-2cnc2ccccc12