Reaction Details
TargetDNA topoisomerase 1
LigandBDBM50326191
Substrate/Competitorn/a
Meas. Tech.ChEMBL_659083 (CHEMBL1246696)
IC50 8500±n/a nM
Citation Tseng, CHTzeng, CCYang, CLLu, PJChen, HLLi, HYChuang, YCYang, CNChen, YL Synthesis and antiproliferative evaluation of certain indeno[1,2-c]quinoline derivatives. Part 2. J Med Chem53:6164-79 (2010) 
 
DNA topoisomerase 1
Name:DNA topoisomerase 1
Type:Enzyme
Mol. Mass.:90771.02
Organism:Homo sapiens (Human)
Description:P11387
Residue:765
BDBM50326191
NameBDBM50326191
Synonyms:(E)-9-methoxy-6-(piperazin-1-yl)-11H-indeno[1,2-c]quinolin-11-one O-2-(dimethylamino)ethyl oxime CHEMBL258919
TypeSmall organic molecule
Emp. Form.C25H29N5O2
Mol. Mass.431.5301
SMILESCOc1ccc-2c(c1)\C(=N/OCCN(C)C)c1c-2c(nc2ccccc12)N1CCNCC1