Reaction Details
TargetDipeptidyl peptidase 2
LigandBDBM50146971
Substrate/Competitorn/a
Meas. Tech.ChEMBL_657416 (CHEMBL1246392)
IC50 5±n/a nM
Citation Tsai, TYYeh, TKChen, XHsu, TJao, YCHuang, CHSong, JSHuang, YCChien, CHChiu, JHYen, SCTang, HKChao, YSJiaang, WT Substituted 4-carboxymethylpyroglutamic acid diamides as potent and selective inhibitors of fibroblast activation protein. J Med Chem53:6572-83 (2010) 
 
Dipeptidyl peptidase 2
Name:Dipeptidyl peptidase 2
Type:Protein
Mol. Mass.:54339.29
Organism:Homo sapiens (Human)
Description:Q9UHL4
Residue:492
BDBM50146971
NameBDBM50146971
Synonyms:2-(S)-Amino-4-(2-chloro-benzylamino)-1-piperidin-1-yl-butan-1-one | CHEMBL98762
TypeSmall organic molecule
Emp. Form.C16H24ClN3O
Mol. Mass.309.834
SMILESN[C@@H](CCNCc1ccccc1Cl)C(=O)N1CCCCC1