Reaction Details
TargetDipeptidyl peptidase 4
LigandBDBM50326372
Substrate/Competitorn/a
Meas. Tech.ChEMBL_657417 (CHEMBL1246393)
IC50 10±n/a nM
Citation Tsai, TYYeh, TKChen, XHsu, TJao, YCHuang, CHSong, JSHuang, YCChien, CHChiu, JHYen, SCTang, HKChao, YSJiaang, WT Substituted 4-carboxymethylpyroglutamic acid diamides as potent and selective inhibitors of fibroblast activation protein. J Med Chem53:6572-83 (2010) 
 
Dipeptidyl peptidase 4
Name:Dipeptidyl peptidase 4
Type:Enzyme
Mol. Mass.:88271.01
Organism:Homo sapiens (Human)
Description:P27487
Residue:766
BDBM50326372
NameBDBM50326372
Synonyms:(S)-1-((S)-2-amino-5-(1-oxoisoindolin-2-yl)pentanoyl)pyrrolidine-2-carbonitrile | CHEMBL1243372
TypeSmall organic molecule
Emp. Form.C18H22N4O2
Mol. Mass.326.3929
SMILESN[C@@H](CCCN1Cc2ccccc2C1=O)C(=O)N1CCC[C@H]1C#N