Reaction Details
TargetRas-related protein Rap-1A
LigandBDBM50310364
Substrate/Competitorn/a
Meas. Tech.ChEMBL_676191 (CHEMBL1273311)
Kd 4000±n/a nM
Citation Ujihara, SOishi, TMouri, RTamate, RKonoki, KMatsumori, NMurata, MOshima, YSugiyama, NTomita, MIshihama, Y Detection of Rap1A as a yessotoxin binding protein from blood cell membranes. Bioorg Med Chem Lett20:6443-6 (2010) 
 
Ras-related protein Rap-1A
Name:Ras-related protein Rap-1A
Type:PROTEIN
Mol. Mass.:20986.96
Organism:Homo sapiens (Human)
Description:ChEMBL_676192
Residue:184
BDBM50310364
NameBDBM50310364
Synonyms:CHEMBL1077126 | YESSOTOXIN
TypeSmall organic molecule
Emp. Form.C55H80O20S2
Mol. Mass.1125.343
SMILESC[C@H]1CC[C@]2(C)O[C@]3(C)CC[C@@H]4O[C@@H]5C[C@@H]6O[C@@H]7C[C@H](OS([O-])(=O)=O)[C@@](C)(CCOS([O-])(=O)=O)O[C@H]7C[C@H]6O[C@H]5C[C@H]4O[C@H]3C[C@H]2O[C@H]2C[C@H]3O[C@H]4C[C@H]5O[C@@H](C(=C)C[C@@H]5O[C@]4(C)C[C@@H]3O[C@H]12)[C@](C)(O)\C=C\C(=C)CC=C