Reaction Details
TargetTyrosine-protein kinase JAK2
LigandBDBM50355501
Substrate/Competitorn/a
Meas. Tech.ChEMBL_686110 (CHEMBL1292866)
IC50 3±n/a nM
Citation Malerich, JPLam, JSHart, BFine, RMKlebansky, BTanga, MJD'Andrea, A Diamino-1,2,4-triazole derivatives are selective inhibitors of TYK2 and JAK1 over JAK2 and JAK3. Bioorg Med Chem Lett20:7454-7 (2010) 
 
Tyrosine-protein kinase JAK2
Name:Tyrosine-protein kinase JAK2
Type:Protein
Mol. Mass.:130684.68
Organism:Homo sapiens (Human)
Description:O60674
Residue:1132
BDBM50355501
NameBDBM50355501
Synonyms:INCB-018424 RUXOLITINIB PHOSPHATE US10766894, Compound TABLE 1.1 US11203595, TABLE 1.1 | US11279703, TABLE 6.147
TypeSmall organic molecule
Emp. Form.C17H18N6
Mol. Mass.306.365
SMILESN#CC[C@H](C1CCCC1)n1cc(cn1)-c1ncnc2[nH]ccc12