Reaction Details
TargetDelta-type opioid receptor
LigandBDBM50334988
Substrate/Competitorn/a
Meas. Tech.ChEMBL_702694 (CHEMBL1657768)
EC50 0.120000±n/a nM
Citation Cowell, SMHanlon, KE Development of potent µ and d opioid agonists with high lipophilicity. J Med Chem54:382-6 (2011) 
 
Delta-type opioid receptor
Name:Delta-type opioid receptor
Type:G Protein-Coupled Receptor (GPCR)
Mol. Mass.:40382.98
Organism:Homo sapiens (Human)
Description:Competition binding assays were carried out using membrane preparations from transfected HN9.10 cells that constitutively expressed the delta opioid receptor.
Residue:372
BDBM50334988
NameBDBM50334988
Synonyms:(S)-2-amino-N-((R)-1-(2-((S)-3-(4-fluorophenyl)-1-oxo-1-(4-(N-phenylpropionamido)piperidin-1-yl)propan-2-ylamino)-2-oxoethylamino)-1-oxopropan-2-yl)-3-(4-hydroxy-2,6-dimethylphenyl)propanamide | CHEMBL1649946
TypeSmall organic molecule
Emp. Form.C39H49FN6O6
Mol. Mass.716.8414
SMILESCCC(=O)N(C1CCN(CC1)C(=O)[C@H](Cc1ccc(F)cc1)NC(=O)CNC(=O)[C@@H](C)NC(=O)[C@@H](N)Cc1c(C)cc(O)cc1C)c1ccccc1