Reaction Details
TargetBifunctional dihydrofolate reductase-thymidylate synthase
LigandBDBM50335104
Substrate/Competitorn/a
Meas. Tech.ChEMBL_702838 (CHEMBL1655368)
IC50 139000±n/a nM
Citation Shi, KHuang, QHuang, YLee, TCYu, H Reducing the brittleness of zein films through chemical modification. J Agric Food Chem59:56-61 (2011) 
 
Bifunctional dihydrofolate reductase-thymidylate synthase
Name:Bifunctional dihydrofolate reductase-thymidylate synthase
Type:Protein
Mol. Mass.:58691.04
Organism:Leishmania major
Description:P07382
Residue:520
BDBM50335104
NameBDBM50335104
Synonyms:3-(5-Amino-[1,3,4]thiadiazol-2-yl)-1-(thiophen-2-yl)propan-1-one | CHEMBL1650287
TypeSmall organic molecule
Emp. Form.C9H9N3OS2
Mol. Mass.239.317
SMILESNc1nnc(CCC(=O)c2cccs2)s1